{"text_format":"1","workbook":"xlsx","n_sheets":4,"sheets":["提出用","提出用写","入力用","提出用控"],"not_rendered":{"charts":0,"images":3,"macros":1,"external_links":0,"defined_names":4,"comments":0,"pivot_tables":0},"unopened":[],"bounds":{"document_bytes":16777216,"sheet_cells":100000,"rows_first":2000,"rows_last":500,"rows_between":2000,"halvings":0,"cell_chars":16384,"cell_head_chars":4096},"cells_cut":0,"cells_raw":0,"read":"whole","date_system":"1900"}

{"sheet":"提出用","index":0,"n_rows":106,"n_cols":65,"rows_kept":106,"cut":false,"hidden":false,"merged":[[21,56,21,57],[18,44,18,64],[12,48,12,50],[12,36,12,38],[11,31,11,58],[12,34,12,35],[12,31,12,33],[19,44,19,54],[21,44,22,45],[21,40,22,40],[21,41,21,42],[18,23,18,43],[19,55,19,64],[21,46,21,47],[21,48,22,48],[21,49,21,50],[21,51,22,51],[21,52,21,53],[21,64,22,64],[19,34,19,43],[21,25,21,26],[21,27,22,27],[21,28,21,29],[21,30,22,30],[21,54,22,54],[21,23,22,24],[19,23,19,33],[31,20,32,20],[31,25,32,25],[31,28,32,28],[31,31,32,31],[21,11,22,11],[26,10,26,64],[27,10,27,43],[28,10,28,64],[24,10,24,64],[25,10,25,64],[21,43,22,43],[21,31,21,32],[21,33,22,33],[21,34,22,34],[21,58,22,58],[21,59,21,60],[21,61,22,61],[21,19,22,19],[21,20,21,21],[27,54,27,57],[27,60,27,64],[21,55,22,55],[14,1,14,9],[13,1,13,9],[13,10,13,64],[14,10,14,64],[31,34,32,34],[29,32,29,56],[18,1,18,22],[21,14,21,15],[21,16,22,16],[21,22,22,22],[21,6,21,7],[21,9,21,10],[19,1,19,11],[21,1,22,1],[21,5,22,5],[21,12,22,13],[19,12,19,22],[21,8,22,8],[29,10,29,20],[31,35,31,36],[31,12,31,13],[31,15,31,16],[29,57,33,64],[31,18,31,19],[36,1,36,64],[35,1,35,64],[34,2,34,9],[34,10,34,56],[34,57,34,64],[31,23,31,24],[31,26,31,27],[31,29,31,30],[31,37,32,37],[31,40,32,40],[31,43,32,46],[31,49,32,49],[31,52,32,52],[31,55,32,56],[31,14,32,14],[31,17,32,17],[29,2,33,9],[31,10,32,11],[31,21,32,22],[29,21,29,31],[39,1,45,43],[37,1,38,43],[37,44,40,54],[41,44,41,64],[42,44,42,64],[38,55,39,55],[38,56,38,57],[44,44,45,60],[43,44,43,64],[38,58,39,58],[38,59,38,60],[38,61,39,61],[38,62,38,63],[38,64,39,64],[3,1,3,64],[5,38,7,64],[5,1,7,23],[9,27,10,28],[9,22,10,23],[9,17,10,18],[9,10,10,13],[9,14,10,16],[9,19,10,21],[9,24,10,26],[9,29,12,30],[11,10,11,28],[9,31,10,58],[5,24,7,37],[12,45,12,47],[12,42,12,44],[12,39,12,41],[9,59,10,64],[11,59,11,64],[12,62,12,64],[12,59,12,61],[12,56,12,58],[12,54,12,55],[12,51,12,53],[15,1,17,9],[16,10,16,48],[15,49,17,64],[15,10,15,48],[31,38,31,39],[31,41,31,42],[31,47,31,48],[31,50,31,51],[31,53,31,54],[27,44,27,47],[27,48,27,52],[27,58,27,59],[24,1,34,1],[26,2,26,9],[27,2,28,9],[25,2,25,9],[21,2,21,4],[22,2,22,3],[24,2,24,9],[21,35,21,36],[21,37,22,37],[21,38,21,39],[21,62,21,63],[21,17,21,18]]}
[]
[null,"第16号の８様式（提出用）"]
[]
[null,"営　業　の　開　廃　等　の　報　告　書"]
[]
[null,"下記のとおり地方税法",null,null,null,null,null,null,null,null,null,null,null,null,null,null,null,null,null,null,null,null,null,null,"第74条の16第1項",null,null,null,null,null,null,null,null,null,null,null,null,null,"の規定により報告します。"]
[]
[]
[]
[null,null,null,null,null,null,null,null,null,null,"令和",null,null,null,null,null,null,"年",null,null,null,null,"月",null,null,null,null,"日",null,"※処理事項",null,"事業者コード",null,null,null,null,null,null,null,null,null,null,null,null,null,null,null,null,null,null,null,null,null,null,null,null,null,null,null,"処理\n区分"]
[]
[null,null,null,null,null,null,null,null,null,null,"東京都　港　都税事務所長　殿"]
[]
[null,"フリガナ"]
[null,"特定販売業者又\nは卸売販売業者\nの氏名又は名称"]
[null,"個人番号又\nは法人番号",null,null,null,null,null,null,null,null,"　↓個人番号の記載に当たっては、左端を空欄とし、ここから記載してください。"]
[]
[]
[null,"特定販売業者",null,null,null,null,null,null,null,null,null,null,null,null,null,null,null,null,null,null,null,null,null,"卸売販売業者",null,null,null,null,null,null,null,null,null,null,null,null,null,null,null,null,null,null,null,null,"小売販売業者"]
[null,"登録年月日",null,null,null,null,null,null,null,null,null,null,"営業廃止又は\n登録取消年月日",null,null,null,null,null,null,null,null,null,null,"登録年月日",null,null,null,null,null,null,null,null,null,null,"営業廃止又は\n登録取消年月日",null,null,null,null,null,null,null,null,null,"許可年月日",null,null,null,null,null,null,null,null,null,null,"許可取消年月日"]
[]
[null,"令和",null,null,null,"年",null,null,"月",null,null,"日","令和",null,null,null,"年",null,null,"月",null,null,"日","令和",null,null,null,"年",null,null,"月",null,null,"日","令和",null,null,"年",null,null,"月",null,null,"日","令和",null,null,null,"年",null,null,"月",null,null,"日","令和",null,null,"年",null,null,"月",null,null,"日"]
[]
[]
[null,"事務所又は事業所","フリガナ"]
[null,null,"名称"]
[null,null,"フリガナ"]
[null,null,"所在地",null,null,null,null,null,null,null,null,null,null,null,null,null,null,null,null,null,null,null,null,null,null,null,null,null,null,null,null,null,null,null,null,null,null,null,null,null,null,null,null,null,"電話（",null,null,null,null,null,null,null,null,"）",null,null,null,null,"－"]
[]
[null,null,"営業の開始、廃止等の年月日",null,null,null,null,null,null,null,"開始年月日",null,null,null,null,null,null,null,null,null,null,"廃止年月日",null,null,null,null,null,null,null,null,null,null,"休止期間"]
[]
[null,null,null,null,null,null,null,null,null,null,"令和",null,null,null,"年",null,null,"月",null,null,"日","令和",null,null,null,"年",null,null,"月",null,null,"日",null,null,"令和",null,null,"年",null,null,"月",null,null,"日から令和",null,null,null,null,null,"年",null,null,"月",null,null,"日まで"]
[]
[]
[null,null,"営業の廃止\n及び休止の\n理由"]
[null,"上記の事務所又は営業所の営業区域"]
[]
[null,"その他参考となるべき事項",null,null,null,null,null,null,null,null,null,null,null,null,null,null,null,null,null,null,null,null,null,null,null,null,null,null,null,null,null,null,null,null,null,null,null,null,null,null,null,null,null,null,"異動年月日"]
[null,null,null,null,null,null,null,null,null,null,null,null,null,null,null,null,null,null,null,null,null,null,null,null,null,null,null,null,null,null,null,null,null,null,null,null,null,null,null,null,null,null,null,null,null,null,null,null,null,null,null,null,null,null,null,"令和",null,null,"年",null,null,"月",null,null,"日"]
[]
[]
[null,null,null,null,null,null,null,null,null,null,null,null,null,null,null,null,null,null,null,null,null,null,null,null,null,null,null,null,null,null,null,null,null,null,null,null,null,null,null,null,null,null,null,null,"報告者"]
[]
[null,null,null,null,null,null,null,null,null,null,null,null,null,null,null,null,null,null,null,null,null,null,null,null,null,null,null,null,null,null,null,null,null,null,null,null,null,null,null,null,null,null,null,null,"氏名"]
[]
[]
[]
[]
[]
[]
[]
[]
[]
[]
[]
[]
[]
[]
[]
[]
[]
[]
[]
[]
[]
[]
[]
[]
[]
[]
[]
[]
[]
[]
[]
[]
[]
[]
[]
[]
[]
[]
[]
[]
[]
[]
[]
[]
[]
[]
[]
[]
[]
[]
[]
[]
[]
[null,"第74条の16第1項"]
[null,"第74条の16第2項"]
[null,"第74条の16第1項及び第2項"]
[]
[]
[]
[null,"昭和"]
[null,"平成"]
[null,"令和"]

{"sheet":"提出用写","index":1,"n_rows":45,"n_cols":65,"rows_kept":45,"cut":false,"hidden":true,"merged":[[11,31,11,58],[12,34,12,35],[12,36,12,38],[3,1,3,64],[5,1,7,23],[5,38,7,64],[9,10,10,13],[9,14,10,16],[9,17,10,18],[9,19,10,21],[9,22,10,23],[9,24,10,26],[9,27,10,28],[9,29,12,30],[9,31,10,58],[9,59,10,64],[11,10,11,28],[11,59,11,64],[12,31,12,33],[5,24,7,37],[18,44,18,64],[19,1,19,11],[19,12,19,22],[19,23,19,33],[19,34,19,43],[19,44,19,54],[19,55,19,64],[12,56,12,58],[12,59,12,61],[12,62,12,64],[13,1,13,9],[13,10,13,64],[14,1,14,9],[14,10,14,64],[12,39,12,41],[12,42,12,44],[12,45,12,47],[12,48,12,50],[12,51,12,53],[12,54,12,55],[15,1,17,9],[16,10,16,48],[15,49,17,64],[15,10,15,48],[21,1,22,1],[21,2,21,4],[21,5,22,5],[21,6,21,7],[21,8,22,8],[21,9,21,10],[22,2,22,3],[18,1,18,22],[18,23,18,43],[21,20,21,21],[21,22,22,22],[21,23,22,24],[21,25,21,26],[21,27,22,27],[21,28,21,29],[21,11,22,11],[21,12,22,13],[21,14,21,15],[21,16,22,16],[21,17,21,18],[21,19,22,19],[21,38,21,39],[21,40,22,40],[21,41,21,42],[21,43,22,43],[21,44,22,45],[21,46,21,47],[21,30,22,30],[21,31,21,32],[21,33,22,33],[21,34,22,34],[21,35,21,36],[21,37,22,37],[21,56,21,57],[21,58,22,58],[21,59,21,60],[21,61,22,61],[21,62,21,63],[21,64,22,64],[21,48,22,48],[21,49,21,50],[21,51,22,51],[21,52,21,53],[21,54,22,54],[21,55,22,55],[28,10,28,64],[29,2,33,9],[29,10,29,20],[29,21,29,31],[29,32,29,56],[29,57,33,64],[31,10,32,11],[31,12,31,13],[31,14,32,14],[31,15,31,16],[27,2,28,9],[27,10,27,43],[31,49,32,49],[31,50,31,51],[31,52,32,52],[31,53,31,54],[31,55,32,56],[27,44,27,47],[27,48,27,52],[27,54,27,57],[27,60,27,64],[27,58,27,59],[34,2,34,9],[34,10,34,56],[31,37,32,37],[31,38,31,39],[31,40,32,40],[31,41,31,42],[31,43,32,46],[31,47,31,48],[31,26,31,27],[31,28,32,28],[31,29,31,30],[31,31,32,31],[31,34,32,34],[31,35,31,36],[31,17,32,17],[31,18,31,19],[31,20,32,20],[31,21,32,22],[31,23,31,24],[31,25,32,25],[38,62,38,63],[38,64,39,64],[39,1,45,43],[41,44,41,64],[42,44,42,64],[43,44,43,64],[34,57,34,64],[35,1,35,64],[36,1,36,64],[37,1,38,43],[37,44,40,54],[38,55,39,55],[38,56,38,57],[38,58,39,58],[38,59,38,60],[38,61,39,61],[24,1,34,1],[24,2,24,9],[24,10,24,64],[25,2,25,9],[25,10,25,64],[44,44,45,60],[26,2,26,9],[26,10,26,64]]}
[]
[null,"第16号の８様式（提出用写）"]
[]
[null,"営　業　の　開　廃　等　の　報　告　書"]
[]
[null,"下記のとおり地方税法",null,null,null,null,null,null,null,null,null,null,null,null,null,null,null,null,null,null,null,null,null,null,{"$f":"IF(提出用!Y6=\"\",\"\",提出用!Y6)","v":"第74条の16第1項"},null,null,null,null,null,null,null,null,null,null,null,null,null,"の規定により報告します。"]
[]
[]
[]
[null,null,null,null,null,null,null,null,null,null,"令和",null,null,null,{"$f":"IF(提出用!O10=\"\",\"\",提出用!O10)","v":""},null,null,"年",null,{"$f":"IF(提出用!T10=\"\",\"\",提出用!T10)","v":""},null,null,"月",null,{"$f":"IF(提出用!Y10=\"\",\"\",提出用!Y10)","v":""},null,null,"日",null,"※処理事項",null,"事業者コード",null,null,null,null,null,null,null,null,null,null,null,null,null,null,null,null,null,null,null,null,null,null,null,null,null,null,null,"処理\n区分"]
[]
[null,null,null,null,null,null,null,null,null,null,"東京都　港　都税事務所長　殿",null,null,null,null,null,null,null,null,null,null,null,null,null,null,null,null,null,null,null,null,{"$f":"IF(提出用!AF12=\"\",\"\",提出用!AF12)","v":""}]
[]
[null,"フリガナ",null,null,null,null,null,null,null,null,{"$f":"IF(提出用!K14=\"\",\"\",提出用!K14)","v":""}]
[null,"特定販売業者又\nは卸売販売業者\nの氏名又は名称",null,null,null,null,null,null,null,null,{"$f":"IF(提出用!K15=\"\",\"\",提出用!K15)","v":""}]
[null,"個人番号又\nは法人番号",null,null,null,null,null,null,null,null,"　 　　　↓個人番号の記載に当たっては、左端を空欄とし、ここから記載してください。"]
[null,null,null,null,null,null,null,null,null,null,{"$f":"IF(提出用!K17=\"\",\"\",提出用!K17)","v":""}]
[]
[null,"特定販売業者",null,null,null,null,null,null,null,null,null,null,null,null,null,null,null,null,null,null,null,null,null,"卸売販売業者",null,null,null,null,null,null,null,null,null,null,null,null,null,null,null,null,null,null,null,null,"小売販売業者"]
[null,"登録年月日",null,null,null,null,null,null,null,null,null,null,"営業廃止又は\n登録取消年月日",null,null,null,null,null,null,null,null,null,null,"登録年月日",null,null,null,null,null,null,null,null,null,null,"営業廃止又は\n登録取消年月日",null,null,null,null,null,null,null,null,null,"許可年月日",null,null,null,null,null,null,null,null,null,null,"許可取消年月日"]
[]
[null,{"$f":"IF(提出用!B22=\"\",\"\",提出用!B22)","v":"令和"},{"$f":"IF(提出用!C22=\"\",\"\",提出用!C22)","v":""},null,null,"年",{"$f":"IF(提出用!G22=\"\",\"\",提出用!G22)","v":""},null,"月",{"$f":"IF(提出用!J22=\"\",\"\",提出用!J22)","v":""},null,"日","令和",null,{"$f":"IF(提出用!O22=\"\",\"\",提出用!O22)","v":""},null,"年",{"$f":"IF(提出用!R22=\"\",\"\",提出用!R22)","v":""},null,"月",{"$f":"IF(提出用!U22=\"\",\"\",提出用!U22)","v":""},null,"日",{"$f":"IF(提出用!X22=\"\",\"\",提出用!X22)","v":"令和"},null,{"$f":"IF(提出用!Z22=\"\",\"\",提出用!Z22)","v":""},null,"年",{"$f":"IF(提出用!AC22=\"\",\"\",提出用!AC22)","v":""},null,"月",{"$f":"IF(提出用!AF22=\"\",\"\",提出用!AF22)","v":""},null,"日","令和",{"$f":"IF(提出用!AJ22=\"\",\"\",提出用!AJ22)","v":""},null,"年",{"$f":"IF(提出用!AM22=\"\",\"\",提出用!AM22)","v":""},null,"月",{"$f":"IF(提出用!AP22=\"\",\"\",提出用!AP22)","v":""},null,"日",{"$f":"IF(提出用!AS22=\"\",\"\",提出用!AS22)","v":"令和"},null,{"$f":"IF(提出用!AU22=\"\",\"\",提出用!AU22)","v":""},null,"年",{"$f":"IF(提出用!AX22=\"\",\"\",提出用!AX22)","v":""},null,"月",{"$f":"IF(提出用!BA22=\"\",\"\",提出用!BA22)","v":""},null,"日","令和",{"$f":"IF(提出用!BE22=\"\",\"\",提出用!BE22)","v":""},null,"年",{"$f":"IF(提出用!BH22=\"\",\"\",提出用!BH22)","v":""},null,"月",{"$f":"IF(提出用!BK22=\"\",\"\",提出用!BK22)","v":""},null,"日"]
[]
[]
[null,"事務所又は事業所","フリガナ",null,null,null,null,null,null,null,{"$f":"IF(提出用!K25=\"\",\"\",提出用!K25)","v":""}]
[null,null,"名称",null,null,null,null,null,null,null,{"$f":"IF(提出用!K26=\"\",\"\",提出用!K26)","v":""}]
[null,null,"フリガナ",null,null,null,null,null,null,null,{"$f":"IF(提出用!K27=\"\",\"\",提出用!K27)","v":""}]
[null,null,"所在地",null,null,null,null,null,null,null,null,null,null,null,null,null,null,null,null,null,null,null,null,null,null,null,null,null,null,null,null,null,null,null,null,null,null,null,null,null,null,null,null,null,"電話（",null,null,null,{"$f":"IF(提出用!AW28=\"\",\"\",提出用!AW28)","v":""},null,null,null,null,"）",{"$f":"IF(提出用!BC28=\"\",\"\",提出用!BC28)","v":""},null,null,null,"－",null,{"$f":"IF(提出用!BI28=\"\",\"\",提出用!BI28)","v":""}]
[null,null,null,null,null,null,null,null,null,null,{"$f":"IF(提出用!K29=\"\",\"\",提出用!K29)","v":""}]
[null,null,"営業の開始、廃止等の年月日",null,null,null,null,null,null,null,"開始年月日",null,null,null,null,null,null,null,null,null,null,"廃止年月日",null,null,null,null,null,null,null,null,null,null,"休止期間"]
[]
[null,null,null,null,null,null,null,null,null,null,"令和",null,{"$f":"IF(提出用!M32=\"\",\"\",提出用!M32)","v":""},null,"年",{"$f":"IF(提出用!P32=\"\",\"\",提出用!P32)","v":""},null,"月",{"$f":"IF(提出用!S32=\"\",\"\",提出用!S32)","v":""},null,"日","令和",null,{"$f":"IF(提出用!X32=\"\",\"\",提出用!X32)","v":""},null,"年",{"$f":"IF(提出用!AA32=\"\",\"\",提出用!AA32)","v":""},null,"月",{"$f":"IF(提出用!AD32=\"\",\"\",提出用!AD32)","v":""},null,"日",null,null,"令和",{"$f":"IF(提出用!AJ32=\"\",\"\",提出用!AJ32)","v":""},null,"年",{"$f":"IF(提出用!AM32=\"\",\"\",提出用!AM32)","v":""},null,"月",{"$f":"IF(提出用!AP32=\"\",\"\",提出用!AP32)","v":""},null,"日から令和",null,null,null,{"$f":"IF(提出用!AV32=\"\",\"\",提出用!AV32)","v":""},null,"年",{"$f":"IF(提出用!AY32=\"\",\"\",提出用!AY32)","v":""},null,"月",{"$f":"IF(提出用!BB32=\"\",\"\",提出用!BB32)","v":""},null,"日まで"]
[]
[]
[null,null,"営業の廃止\n及び休止の\n理由",null,null,null,null,null,null,null,{"$f":"IF(提出用!K35=\"\",\"\",提出用!K35)","v":""}]
[null,"上記の事務所又は営業所の営業区域"]
[null,{"$f":"IF(提出用!B37=\"\",\"\",提出用!B37)","v":""}]
[null,"その他参考となるべき事項",null,null,null,null,null,null,null,null,null,null,null,null,null,null,null,null,null,null,null,null,null,null,null,null,null,null,null,null,null,null,null,null,null,null,null,null,null,null,null,null,null,null,"異動年月日"]
[null,null,null,null,null,null,null,null,null,null,null,null,null,null,null,null,null,null,null,null,null,null,null,null,null,null,null,null,null,null,null,null,null,null,null,null,null,null,null,null,null,null,null,null,null,null,null,null,null,null,null,null,null,null,null,"令和",{"$f":"IF(提出用!BE39=\"\",\"\",提出用!BE39)","v":""},null,"年",{"$f":"IF(提出用!BH39=\"\",\"\",提出用!BH39)","v":""},null,"月",{"$f":"IF(提出用!BK39=\"\",\"\",提出用!BK39)","v":""},null,"日"]
[null,{"$f":"IF(提出用!B40=\"\",\"\",提出用!B40)","v":""}]
[]
[null,null,null,null,null,null,null,null,null,null,null,null,null,null,null,null,null,null,null,null,null,null,null,null,null,null,null,null,null,null,null,null,null,null,null,null,null,null,null,null,null,null,null,null,"報告者"]
[null,null,null,null,null,null,null,null,null,null,null,null,null,null,null,null,null,null,null,null,null,null,null,null,null,null,null,null,null,null,null,null,null,null,null,null,null,null,null,null,null,null,null,null,{"$f":"IF(提出用!AS43=\"\",\"\",提出用!AS43)","v":""}]
[null,null,null,null,null,null,null,null,null,null,null,null,null,null,null,null,null,null,null,null,null,null,null,null,null,null,null,null,null,null,null,null,null,null,null,null,null,null,null,null,null,null,null,null,"氏名"]
[null,null,null,null,null,null,null,null,null,null,null,null,null,null,null,null,null,null,null,null,null,null,null,null,null,null,null,null,null,null,null,null,null,null,null,null,null,null,null,null,null,null,null,null,{"$f":"IF(提出用!AS45=\"\",\"\",提出用!AS45)","v":""}]

{"sheet":"入力用","index":2,"n_rows":39,"n_cols":63,"rows_kept":39,"cut":false,"hidden":false,"merged":[[3,1,3,64],[5,1,7,23],[5,24,5,37],[5,38,7,64],[7,24,7,37],[9,10,10,13],[9,14,10,16],[9,17,10,18],[9,19,10,21],[9,22,10,23],[9,24,10,26],[9,27,10,28],[9,29,12,30],[9,31,10,58],[9,59,10,64],[11,10,11,28],[11,31,11,58],[12,56,12,58],[12,59,12,61],[12,62,12,64],[13,10,13,64],[14,10,14,64],[13,6,13,9],[14,6,14,9],[11,59,11,64],[12,31,12,33],[12,34,12,35],[12,36,12,38],[12,39,12,41],[12,42,12,44],[12,45,12,47],[12,48,12,50],[12,51,12,53],[12,54,12,55],[19,44,19,54],[19,55,19,64],[21,33,22,33],[21,34,22,34],[21,35,21,36],[21,37,22,37],[21,41,21,42],[21,46,21,47],[21,43,22,43],[21,44,22,45],[21,49,21,50],[21,51,22,51],[21,52,21,53],[21,54,22,54],[21,55,22,55],[21,38,21,39],[21,40,22,40],[31,10,32,11],[31,21,32,22],[31,20,32,20],[18,1,18,22],[18,23,18,43],[21,20,21,21],[21,25,21,26],[21,27,22,27],[21,28,21,29],[21,11,22,11],[21,12,22,13],[21,22,22,22],[31,8,32,9],[31,31,32,33],[28,10,28,64],[29,10,29,20],[29,21,29,31],[29,32,29,56],[29,57,33,64],[18,44,18,64],[19,1,19,11],[19,12,19,22],[19,23,19,33],[19,34,19,43],[38,62,38,63],[38,64,39,64],[39,1,45,43],[41,44,41,64],[42,44,42,64],[43,44,43,64],[44,44,45,64],[38,53,39,54],[34,57,34,64],[35,1,35,64],[36,1,36,64],[37,1,38,43],[38,55,39,55],[38,56,38,57],[38,58,39,58],[38,59,38,60],[38,61,39,61],[24,1,34,1],[24,10,24,64],[25,10,25,64],[34,2,34,9],[34,10,34,56],[31,49,32,49],[31,53,31,54],[31,12,31,13],[31,14,32,14],[31,15,31,16],[31,50,31,51],[31,52,32,52],[31,55,32,56],[31,43,32,44],[31,45,32,46],[31,37,32,37],[31,38,31,39],[31,40,32,40],[31,41,31,42],[31,47,31,48],[31,26,31,27],[31,28,32,28],[31,29,31,30],[31,34,32,34],[31,35,31,36],[31,17,32,17],[31,18,31,19],[31,23,31,24],[31,25,32,25],[26,6,26,9],[27,6,28,9],[21,56,21,57],[21,58,22,58],[21,59,21,60],[21,61,22,61],[26,10,26,64],[27,10,27,43],[27,44,27,47],[27,48,27,52],[27,54,27,57],[27,60,27,64],[27,58,27,59],[21,23,22,24],[21,14,21,15],[21,16,22,16],[21,17,21,18],[21,19,22,19],[21,62,21,63],[21,64,22,64],[21,48,22,48],[21,6,21,7],[21,8,22,8],[21,9,21,10],[21,0,22,0],[25,6,25,9],[24,6,24,9],[21,1,22,1],[21,2,21,4],[21,5,22,5],[22,2,22,3],[21,30,22,30],[21,31,21,32]]}
[]
[null,"第16号の８様式（入力用）"]
[]
[]
[]
[]
[]
[]
[]
[null,null,null,null,null,null,null,null,null,null,null,null,null,null,null,null,null,null,null,null,null,null,null,null,null,null,null,null,null,null,null,"事　業　者　コ　ー　ド",null,null,null,null,null,null,null,null,null,null,null,null,null,null,null,null,null,null,null,null,null,null,null,null,null,null,null,"処理\n区分"]
[]
[null,null,null,null,null,null,null,null,null,null,null,null,null,null,null,null,null,null,null,null,null,null,null,null,null,null,null,null,null,null,null,{"$f":"IF(提出用!AF12=\"\",\"\",提出用!AF12)","v":""}]
[]
[null,null,null,null,null,null,"Ｎ１",null,null,null,{"$f":"IF(提出用!K14=\"\",\"\",提出用!K14)","v":""}]
[null,null,null,null,null,null,"Ｓ１",null,null,null,{"$f":"IF(提出用!K15=\"\",\"\",提出用!K15)","v":""}]
[]
[]
[]
[]
[]
[]
["Ｎ２",{"$f":"IF(提出用!B22=\"昭和\",\"S\",IF(提出用!B22=\"平成\",\"H\",\"R\"))","v":"R"},{"$f":"IF(提出用!C22=\"\",\"\",提出用!C22)","v":""},null,null,null,{"$f":"IF(提出用!G22=\"\",\"\",提出用!G22)","v":""},null,null,{"$f":"IF(提出用!J22=\"\",\"\",提出用!J22)","v":""},null,null,"R",null,{"$f":"IF(提出用!O22=\"\",\"\",提出用!O22)","v":""},null,null,{"$f":"IF(提出用!R22=\"\",\"\",提出用!R22)","v":""},null,null,{"$f":"IF(提出用!U22=\"\",\"\",提出用!U22)","v":""},null,null,{"$f":"IF(提出用!X22=\"昭和\",\"S\",IF(提出用!X22=\"平成\",\"H\",\"R\"))","v":"R"},null,{"$f":"IF(提出用!Z22=\"\",\"\",提出用!Z22)","v":""},null,null,{"$f":"IF(提出用!AC22=\"\",\"\",提出用!AC22)","v":""},null,null,{"$f":"IF(提出用!AF22=\"\",\"\",提出用!AF22)","v":""},null,null,"R",{"$f":"IF(提出用!AJ22=\"\",\"\",提出用!AJ22)","v":""},null,null,{"$f":"IF(提出用!AM22=\"\",\"\",提出用!AM22)","v":""},null,null,{"$f":"IF(提出用!AP22=\"\",\"\",提出用!AP22)","v":""},null,null,{"$f":"IF(提出用!AS22=\"昭和\",\"S\",IF(提出用!AS22=\"平成\",\"H\",\"R\"))","v":"R"},null,{"$f":"IF(提出用!AU22=\"\",\"\",提出用!AU22)","v":""},null,null,{"$f":"IF(提出用!AX22=\"\",\"\",提出用!AX22)","v":""},null,null,{"$f":"IF(提出用!BA22=\"\",\"\",提出用!BA22)","v":""},null,null,"R",{"$f":"IF(提出用!BE22=\"\",\"\",提出用!BE22)","v":""},null,null,{"$f":"IF(提出用!BH22=\"\",\"\",提出用!BH22)","v":""},null,null,{"$f":"IF(提出用!BK22=\"\",\"\",提出用!BK22)","v":""}]
[]
[]
[null,null,null,null,null,null,"Ｎ３",null,null,null,{"$f":"IF(提出用!K25=\"\",\"\",提出用!K25)","v":""}]
[null,null,null,null,null,null,"Ｓ２",null,null,null,{"$f":"IF(提出用!K26=\"\",\"\",提出用!K26)","v":""}]
[null,null,null,null,null,null,"Ｎ４",null,null,null,{"$f":"IF(提出用!K27=\"\",\"\",提出用!K27)","v":""}]
[null,null,null,null,null,null,"Ｓ３",null,null,null,null,null,null,null,null,null,null,null,null,null,null,null,null,null,null,null,null,null,null,null,null,null,null,null,null,null,null,null,null,null,null,null,null,null,"電話（",null,null,null,{"$f":"IF(提出用!AW28=\"\",\"\",提出用!AW28)","v":""},null,null,null,null,"）",{"$f":"IF(提出用!BC28=\"\",\"\",提出用!BC28)","v":""},null,null,null,"－",null,{"$f":"IF(提出用!BI28=\"\",\"\",提出用!BI28)","v":""}]
[null,null,null,null,null,null,null,null,null,null,{"$f":"IF(提出用!K29=\"\",\"\",提出用!K29)","v":""}]
[]
[]
[null,null,null,null,null,null,null,null,"Ｎ５",null,{"$f":"IF(提出用!L32=\"昭和\",\"S\",IF(提出用!L32=\"平成\",\"H\",\"R\"))","v":"R"},null,{"$f":"IF(提出用!M32=\"\",\"\",提出用!M32)","v":""},null,null,{"$f":"IF(提出用!P32=\"\",\"\",提出用!P32)","v":""},null,null,{"$f":"IF(提出用!S32=\"\",\"\",提出用!S32)","v":""},null,null,{"$f":"IF(提出用!W32=\"昭和\",\"S\",IF(提出用!W32=\"平成\",\"H\",\"R\"))","v":"R"},null,{"$f":"IF(提出用!X32=\"\",\"\",提出用!X32)","v":""},null,null,{"$f":"IF(提出用!AA32=\"\",\"\",提出用!AA32)","v":""},null,null,{"$f":"IF(提出用!AD32=\"\",\"\",提出用!AD32)","v":""},null,null,null,null,"R",{"$f":"IF(提出用!AJ32=\"\",\"\",提出用!AJ32)","v":""},null,null,{"$f":"IF(提出用!AM32=\"\",\"\",提出用!AM32)","v":""},null,null,{"$f":"IF(提出用!AP32=\"\",\"\",提出用!AP32)","v":""},null,null,null,"R",null,{"$f":"IF(提出用!AV32=\"\",\"\",提出用!AV32)","v":""},null,null,{"$f":"IF(提出用!AY32=\"\",\"\",提出用!AY32)","v":""},null,null,{"$f":"IF(提出用!BB32=\"\",\"\",提出用!BB32)","v":""}]
[]
[]
[]
[]
[]
[]
[null,null,null,null,null,null,null,null,null,null,null,null,null,null,null,null,null,null,null,null,null,null,null,null,null,null,null,null,null,null,null,null,null,null,null,null,null,null,null,null,null,null,null,null,null,null,null,null,null,null,null,null,null,"Ｎ６",null,{"$f":"IF(提出用!BD39=\"昭和\",\"S\",IF(提出用!BD39=\"平成\",\"H\",\"R\"))","v":"R"},{"$f":"IF(提出用!BE39=\"\",\"\",提出用!BE39)","v":""},null,null,{"$f":"IF(提出用!BH39=\"\",\"\",提出用!BH39)","v":""},null,null,{"$f":"IF(提出用!BK39=\"\",\"\",提出用!BK39)","v":""}]

{"sheet":"提出用控","index":3,"n_rows":45,"n_cols":65,"rows_kept":45,"cut":false,"hidden":false,"merged":[[11,31,11,58],[38,62,38,63],[38,64,39,64],[39,1,45,43],[41,44,41,64],[42,44,42,64],[43,44,43,64],[34,57,34,64],[35,1,35,64],[36,1,36,64],[37,1,38,43],[37,44,40,54],[38,55,39,55],[38,56,38,57],[38,58,39,58],[38,59,38,60],[38,61,39,61],[24,1,34,1],[24,2,24,9],[24,10,24,64],[25,2,25,9],[25,10,25,64],[26,2,26,9],[26,10,26,64],[34,2,34,9],[34,10,34,56],[31,37,32,37],[31,38,31,39],[31,40,32,40],[31,41,31,42],[31,43,32,46],[31,47,31,48],[31,26,31,27],[31,28,32,28],[31,29,31,30],[31,31,32,31],[31,34,32,34],[31,35,31,36],[31,17,32,17],[31,18,31,19],[31,20,32,20],[31,21,32,22],[31,23,31,24],[31,25,32,25],[28,10,28,64],[29,2,33,9],[29,10,29,20],[29,21,29,31],[29,32,29,56],[29,57,33,64],[31,10,32,11],[31,12,31,13],[31,14,32,14],[31,15,31,16],[27,2,28,9],[27,10,27,43],[31,49,32,49],[31,50,31,51],[31,52,32,52],[31,53,31,54],[31,55,32,56],[27,44,27,47],[27,48,27,52],[27,54,27,57],[27,60,27,64],[27,58,27,59],[21,56,21,57],[21,58,22,58],[21,59,21,60],[21,61,22,61],[21,62,21,63],[21,64,22,64],[21,48,22,48],[21,49,21,50],[21,51,22,51],[21,52,21,53],[21,54,22,54],[21,55,22,55],[21,43,22,43],[21,44,22,45],[21,46,21,47],[21,30,22,30],[21,31,21,32],[21,33,22,33],[21,34,22,34],[21,35,21,36],[21,37,22,37],[21,1,22,1],[21,2,21,4],[21,5,22,5],[21,6,21,7],[21,8,22,8],[21,9,21,10],[22,2,22,3],[18,1,18,22],[18,23,18,43],[21,20,21,21],[21,22,22,22],[21,23,22,24],[21,25,21,26],[21,27,22,27],[21,28,21,29],[21,11,22,11],[21,12,22,13],[21,14,21,15],[21,16,22,16],[21,17,21,18],[21,19,22,19],[21,38,21,39],[21,40,22,40],[21,41,21,42],[19,55,19,64],[12,56,12,58],[12,59,12,61],[12,62,12,64],[13,1,13,9],[13,10,13,64],[14,1,14,9],[14,10,14,64],[12,39,12,41],[12,42,12,44],[12,45,12,47],[12,48,12,50],[12,51,12,53],[12,34,12,35],[12,36,12,38],[12,54,12,55],[15,1,17,9],[16,10,16,48],[15,49,17,64],[15,10,15,48],[44,44,45,60],[3,1,3,64],[5,1,7,23],[5,38,7,64],[9,10,10,13],[9,14,10,16],[9,17,10,18],[9,19,10,21],[9,22,10,23],[9,24,10,26],[9,27,10,28],[9,29,12,30],[9,31,10,58],[9,59,10,64],[11,10,11,28],[5,24,7,37],[11,59,11,64],[12,31,12,33],[18,44,18,64],[19,1,19,11],[19,12,19,22],[19,23,19,33],[19,34,19,43],[19,44,19,54]]}
[]
[null,"第16号の８様式（提出用控）"]
[]
[null,"営　業　の　開　廃　等　の　報　告　書"]
[]
[null,"下記のとおり地方税法",null,null,null,null,null,null,null,null,null,null,null,null,null,null,null,null,null,null,null,null,null,null,{"$f":"IF(提出用!Y6=\"\",\"\",提出用!Y6)","v":"第74条の16第1項"},null,null,null,null,null,null,null,null,null,null,null,null,null,"の規定により報告します。"]
[]
[]
[]
[null,null,null,null,null,null,null,null,null,null,"令和",null,null,null,{"$f":"IF(提出用!O10=\"\",\"\",提出用!O10)","v":""},null,null,"年",null,{"$f":"IF(提出用!T10=\"\",\"\",提出用!T10)","v":""},null,null,"月",null,{"$f":"IF(提出用!Y10=\"\",\"\",提出用!Y10)","v":""},null,null,"日",null,"※処理事項",null,"事業者コード",null,null,null,null,null,null,null,null,null,null,null,null,null,null,null,null,null,null,null,null,null,null,null,null,null,null,null,"処理\n区分"]
[]
[null,null,null,null,null,null,null,null,null,null,"東京都　港　都税事務所長　殿",null,null,null,null,null,null,null,null,null,null,null,null,null,null,null,null,null,null,null,null,{"$f":"IF(提出用!AF12=\"\",\"\",提出用!AF12)","v":""}]
[]
[null,"フリガナ",null,null,null,null,null,null,null,null,{"$f":"IF(提出用!K14=\"\",\"\",提出用!K14)","v":""}]
[null,"特定販売業者又\nは卸売販売業者\nの氏名又は名称",null,null,null,null,null,null,null,null,{"$f":"IF(提出用!K15=\"\",\"\",提出用!K15)","v":""}]
[null,"個人番号又\nは法人番号",null,null,null,null,null,null,null,null,"　↓個人番号の記載に当たっては、左端を空欄とし、ここから記載してください。"]
[null,null,null,null,null,null,null,null,null,null,{"$f":"IF(提出用!K17=\"\",\"\",提出用!K17)","v":""}]
[]
[null,"特定販売業者",null,null,null,null,null,null,null,null,null,null,null,null,null,null,null,null,null,null,null,null,null,"卸売販売業者",null,null,null,null,null,null,null,null,null,null,null,null,null,null,null,null,null,null,null,null,"小売販売業者"]
[null,"登録年月日",null,null,null,null,null,null,null,null,null,null,"営業廃止又は\n登録取消年月日",null,null,null,null,null,null,null,null,null,null,"登録年月日",null,null,null,null,null,null,null,null,null,null,"営業廃止又は\n登録取消年月日",null,null,null,null,null,null,null,null,null,"許可年月日",null,null,null,null,null,null,null,null,null,null,"許可取消年月日"]
[]
[null,{"$f":"IF(提出用!B22=\"\",\"\",提出用!B22)","v":"令和"},{"$f":"IF(提出用!C22=\"\",\"\",提出用!C22)","v":""},null,null,"年",{"$f":"IF(提出用!G22=\"\",\"\",提出用!G22)","v":""},null,"月",{"$f":"IF(提出用!J22=\"\",\"\",提出用!J22)","v":""},null,"日",{"$f":"IF(提出用!M22=\"\",\"\",提出用!M22)","v":"令和"},null,{"$f":"IF(提出用!O22=\"\",\"\",提出用!O22)","v":""},null,"年",{"$f":"IF(提出用!R22=\"\",\"\",提出用!R22)","v":""},null,"月",{"$f":"IF(提出用!U22=\"\",\"\",提出用!U22)","v":""},null,"日",{"$f":"IF(提出用!X22=\"\",\"\",提出用!X22)","v":"令和"},null,{"$f":"IF(提出用!Z22=\"\",\"\",提出用!Z22)","v":""},null,"年",{"$f":"IF(提出用!AC22=\"\",\"\",提出用!AC22)","v":""},null,"月",{"$f":"IF(提出用!AF22=\"\",\"\",提出用!AF22)","v":""},null,"日","令和",{"$f":"IF(提出用!AJ22=\"\",\"\",提出用!AJ22)","v":""},null,"年",{"$f":"IF(提出用!AM22=\"\",\"\",提出用!AM22)","v":""},null,"月",{"$f":"IF(提出用!AP22=\"\",\"\",提出用!AP22)","v":""},null,"日",{"$f":"IF(提出用!AS22=\"\",\"\",提出用!AS22)","v":"令和"},null,{"$f":"IF(提出用!AU22=\"\",\"\",提出用!AU22)","v":""},null,"年",{"$f":"IF(提出用!AX22=\"\",\"\",提出用!AX22)","v":""},null,"月",{"$f":"IF(提出用!BA22=\"\",\"\",提出用!BA22)","v":""},null,"日","令和",{"$f":"IF(提出用!BE22=\"\",\"\",提出用!BE22)","v":""},null,"年",{"$f":"IF(提出用!BH22=\"\",\"\",提出用!BH22)","v":""},null,"月",{"$f":"IF(提出用!BK22=\"\",\"\",提出用!BK22)","v":""},null,"日"]
[]
[]
[null,"事務所又は事業所","フリガナ",null,null,null,null,null,null,null,{"$f":"IF(提出用!K25=\"\",\"\",提出用!K25)","v":""}]
[null,null,"名称",null,null,null,null,null,null,null,{"$f":"IF(提出用!K26=\"\",\"\",提出用!K26)","v":""}]
[null,null,"フリガナ",null,null,null,null,null,null,null,{"$f":"IF(提出用!K27=\"\",\"\",提出用!K27)","v":""}]
[null,null,"所在地",null,null,null,null,null,null,null,null,null,null,null,null,null,null,null,null,null,null,null,null,null,null,null,null,null,null,null,null,null,null,null,null,null,null,null,null,null,null,null,null,null,"電話（",null,null,null,{"$f":"IF(提出用!AW28=\"\",\"\",提出用!AW28)","v":""},null,null,null,null,"）",{"$f":"IF(提出用!BC28=\"\",\"\",提出用!BC28)","v":""},null,null,null,"－",null,{"$f":"IF(提出用!BI28=\"\",\"\",提出用!BI28)","v":""}]
[null,null,null,null,null,null,null,null,null,null,{"$f":"IF(提出用!K29=\"\",\"\",提出用!K29)","v":""}]
[null,null,"営業の開始、廃止等の年月日",null,null,null,null,null,null,null,"開始年月日",null,null,null,null,null,null,null,null,null,null,"廃止年月日",null,null,null,null,null,null,null,null,null,null,"休止期間"]
[]
[null,null,null,null,null,null,null,null,null,null,{"$f":"IF(提出用!K32=\"\",\"\",提出用!K32)","v":"令和"},null,{"$f":"IF(提出用!M32=\"\",\"\",提出用!M32)","v":""},null,"年",{"$f":"IF(提出用!P32=\"\",\"\",提出用!P32)","v":""},null,"月",{"$f":"IF(提出用!S32=\"\",\"\",提出用!S32)","v":""},null,"日",{"$f":"IF(提出用!V32=\"\",\"\",提出用!V32)","v":"令和"},null,{"$f":"IF(提出用!X32=\"\",\"\",提出用!X32)","v":""},null,"年",{"$f":"IF(提出用!AA32=\"\",\"\",提出用!AA32)","v":""},null,"月",{"$f":"IF(提出用!AD32=\"\",\"\",提出用!AD32)","v":""},null,"日",null,null,"令和",{"$f":"IF(提出用!AJ32=\"\",\"\",提出用!AJ32)","v":""},null,"年",{"$f":"IF(提出用!AM32=\"\",\"\",提出用!AM32)","v":""},null,"月",{"$f":"IF(提出用!AP32=\"\",\"\",提出用!AP32)","v":""},null,"日から令和",null,null,null,{"$f":"IF(提出用!AV32=\"\",\"\",提出用!AV32)","v":""},null,"年",{"$f":"IF(提出用!AY32=\"\",\"\",提出用!AY32)","v":""},null,"月",{"$f":"IF(提出用!BB32=\"\",\"\",提出用!BB32)","v":""},null,"日まで"]
[]
[]
[null,null,"営業の廃止\n及び休止の\n理由",null,null,null,null,null,null,null,{"$f":"IF(提出用!K35=\"\",\"\",提出用!K35)","v":""}]
[null,"上記の事務所又は営業所の営業区域"]
[null,{"$f":"IF(提出用!B37=\"\",\"\",提出用!B37)","v":""}]
[null,"その他参考となるべき事項",null,null,null,null,null,null,null,null,null,null,null,null,null,null,null,null,null,null,null,null,null,null,null,null,null,null,null,null,null,null,null,null,null,null,null,null,null,null,null,null,null,null,"異動年月日"]
[null,null,null,null,null,null,null,null,null,null,null,null,null,null,null,null,null,null,null,null,null,null,null,null,null,null,null,null,null,null,null,null,null,null,null,null,null,null,null,null,null,null,null,null,null,null,null,null,null,null,null,null,null,null,null,{"$f":"IF(提出用!BD39=\"\",\"\",提出用!BD39)","v":"令和"},{"$f":"IF(提出用!BE39=\"\",\"\",提出用!BE39)","v":""},null,"年",{"$f":"IF(提出用!BH39=\"\",\"\",提出用!BH39)","v":""},null,"月",{"$f":"IF(提出用!BK39=\"\",\"\",提出用!BK39)","v":""},null,"日"]
[null,{"$f":"IF(提出用!B40=\"\",\"\",提出用!B40)","v":""}]
[]
[null,null,null,null,null,null,null,null,null,null,null,null,null,null,null,null,null,null,null,null,null,null,null,null,null,null,null,null,null,null,null,null,null,null,null,null,null,null,null,null,null,null,null,null,"報告者"]
[null,null,null,null,null,null,null,null,null,null,null,null,null,null,null,null,null,null,null,null,null,null,null,null,null,null,null,null,null,null,null,null,null,null,null,null,null,null,null,null,null,null,null,null,{"$f":"IF(提出用!AS43=\"\",\"\",提出用!AS43)","v":""}]
[null,null,null,null,null,null,null,null,null,null,null,null,null,null,null,null,null,null,null,null,null,null,null,null,null,null,null,null,null,null,null,null,null,null,null,null,null,null,null,null,null,null,null,null,"氏名"]
[null,null,null,null,null,null,null,null,null,null,null,null,null,null,null,null,null,null,null,null,null,null,null,null,null,null,null,null,null,null,null,null,null,null,null,null,null,null,null,null,null,null,null,null,{"$f":"IF(提出用!AS45=\"\",\"\",提出用!AS45)","v":""}]