{"text_format":"1","workbook":"xlsx","n_sheets":3,"sheets":["入力フォーム","納付書","市区町村データ"],"not_rendered":{"charts":0,"images":1,"macros":1,"external_links":0,"defined_names":5,"comments":1,"pivot_tables":0},"unopened":[],"bounds":{"document_bytes":16777216,"sheet_cells":100000,"rows_first":2000,"rows_last":500,"rows_between":2000,"halvings":0,"cell_chars":16384,"cell_head_chars":4096},"cells_cut":0,"cells_raw":0,"read":"whole","date_system":"1900"}

{"sheet":"入力フォーム","index":0,"n_rows":25,"n_cols":14,"rows_kept":25,"cut":false,"hidden":false,"merged":[[0,1,1,16],[8,7,8,8],[7,13,9,16],[20,3,20,7],[24,3,24,5],[10,5,10,12],[12,5,12,12],[14,5,14,12],[16,5,16,12],[23,9,25,15],[23,8,25,8],[19,9,21,15]]}
[null,"都内区市町村用汎用　区市町村たばこ税手持品課税用納付書　作成ツール"]
[]
[null,null,"納付書提出先選択"]
[]
[null,null,null,null,"（例：新宿区　プルダウンメニューから選択してください。）"]
[]
[null,null,"納付情報入力"]
[null,null,null,null,null,null,null,null,null,null,null,null,null,"申告書をお届けした封筒の宛名の右下に記載された番号を記載してください。（不明な場合は、該当の区市町村にお問合せください。）"]
[null,null,null,"ID番号",null,null,"-",null,null,"（例：01101-0000001）",null,null,"※"]
[]
[null,null,null,"名称",null,null,null,null,null,null,null,null,null,"（例：㈱東京手持品課税）"]
[]
[null,null,null,"所在地",null,null,null,null,null,null,null,null,null,"（例：東京都新宿区西新宿２－８－１）"]
[]
[null,null,null,"店舗名",null,null,null,null,null,null,null,null,null,"（例：東京手持品ストア　立川店）"]
[]
[null,null,null,"店舗住所",null,null,null,null,null,null,null,null,null,"（例：東京都立川市錦町４－６－３）"]
[]
[null,null,"納付理由"]
[null,null,null,null,null,null,null,null,null,"修正申告による場合、更正処分、決定処分による場合を除き、\n「期限内・後申告による納付」を選択してください。"]
[null,null,null,"期限内・後申告による納付",null,null,null,null,"※"]
[]
[null,null,"納付税額"]
[null,null,null,null,null,null,null,null,"※","延滞金、過少申告加算金、不申告加算金、重加算金、\n督促手数料等が発生する場合にはお使いいただけません。"]
[null,null,null,null,null,null,"円"]

{"sheet":"納付書","index":1,"n_rows":106,"n_cols":157,"rows_kept":106,"cut":false,"hidden":false,"merged":[[103,0,104,39],[103,40,104,79],[103,80,104,119],[57,117,60,118],[57,107,60,108],[56,117,56,118],[53,116,55,117],[46,69,48,72],[46,73,48,73],[46,74,48,78],[51,70,52,71],[51,41,55,68],[56,67,56,68],[56,75,56,76],[51,76,52,77],[56,81,56,96],[46,109,48,112],[56,105,56,106],[56,115,56,116],[56,111,56,112],[56,113,56,114],[56,107,56,108],[57,109,60,110],[57,111,60,112],[57,113,60,114],[57,115,60,116],[46,114,48,118],[46,86,48,108],[51,72,52,73],[56,103,56,104],[56,57,56,58],[0,156,0,211],[49,81,50,108],[44,109,45,118],[56,109,56,110],[44,69,45,78],[49,69,50,78],[56,73,56,74],[56,77,56,78],[56,71,56,72],[8,92,11,113],[13,105,14,118],[51,110,52,111],[51,112,52,113],[51,114,52,115],[51,116,52,117],[51,81,55,108],[49,109,50,118],[56,97,56,98],[51,74,52,75],[21,6,21,38],[23,1,24,23],[13,1,14,24],[13,25,14,38],[8,36,12,38],[46,81,48,85],[56,101,56,102],[8,76,12,78],[51,36,52,37],[53,30,55,31],[53,32,55,33],[53,34,55,35],[53,36,55,37],[46,29,48,32],[46,33,48,33],[46,34,48,38],[25,1,27,38],[30,1,32,38],[38,1,43,38],[15,1,18,24],[23,81,24,103],[15,25,18,38],[8,116,12,118],[19,86,19,118],[53,70,55,71],[53,72,55,73],[13,41,14,64],[19,81,22,85],[53,114,55,115],[56,41,56,56],[46,41,48,45],[53,74,55,75],[53,76,55,77],[56,65,56,66],[49,41,50,68],[56,69,56,70],[56,99,56,100],[46,113,48,113],[53,110,55,111],[53,112,55,113],[25,81,27,118],[25,41,27,78],[30,41,32,78],[38,41,43,78],[15,81,18,104],[15,105,18,118],[0,153,0,155],[4,41,5,49],[6,41,8,49],[9,41,11,49],[12,41,12,49],[8,52,11,73],[44,41,45,45],[4,81,5,89],[6,81,8,89],[33,41,36,78],[33,81,36,118],[44,46,45,68],[9,81,11,89],[15,65,18,78],[23,41,24,63],[19,46,19,78],[0,0,0,64],[0,75,0,119],[0,65,0,74],[22,6,22,38],[20,86,20,118],[21,86,21,118],[22,86,22,118],[13,65,14,78],[57,97,60,98],[4,1,5,9],[6,1,8,9],[8,12,11,33],[9,1,11,9],[12,1,12,9],[19,1,22,5],[12,81,12,89],[13,81,14,104],[46,46,48,68],[46,1,48,5],[46,6,48,28],[20,46,20,78],[21,46,21,78],[22,46,22,78],[19,41,22,45],[12,69,12,74],[30,81,32,118],[38,81,43,118],[44,81,45,85],[44,86,45,108],[44,1,45,5],[44,6,45,28],[44,29,45,38],[57,81,60,92],[56,59,56,60],[57,67,60,68],[56,61,56,62],[56,63,56,64],[57,71,60,72],[61,75,63,76],[57,77,60,78],[57,93,60,96],[76,57,80,58],[76,59,80,60],[73,59,75,60],[57,99,60,100],[57,101,60,102],[57,75,60,76],[57,73,60,74],[61,41,63,52],[57,31,60,32],[57,33,60,34],[57,35,60,36],[57,37,60,38],[61,31,63,32],[61,33,63,34],[61,35,63,36],[61,37,63,38],[61,71,63,72],[57,61,60,62],[57,63,60,64],[57,69,60,70],[61,67,63,68],[61,81,63,92],[61,93,63,96],[61,97,63,98],[57,41,60,52],[76,63,80,64],[73,63,75,64],[57,57,60,58],[57,59,60,60],[57,65,60,66],[57,53,60,56],[70,41,72,52],[76,53,80,56],[76,41,80,52],[73,41,75,52],[70,53,72,56],[73,53,75,56],[61,53,63,56],[70,59,72,60],[70,61,72,62],[67,41,69,52],[67,53,69,56],[76,61,80,62],[73,57,75,58],[73,61,75,62],[61,57,63,58],[61,61,63,62],[67,57,69,58],[70,67,72,68],[70,69,72,70],[70,57,72,58],[64,57,66,58],[64,61,66,62],[64,63,66,64],[64,59,66,60],[64,65,66,66],[61,65,63,66],[61,63,63,64],[61,59,63,60],[70,63,72,64],[67,63,69,64],[67,65,69,66],[67,59,69,60],[67,61,69,62],[67,69,69,70],[64,67,66,68],[81,103,100,105],[81,97,83,98],[81,92,83,94],[97,41,98,58],[81,99,83,99],[81,102,83,102],[81,57,83,58],[84,41,89,47],[81,55,83,56],[84,60,86,62],[81,41,83,47],[99,42,100,60],[81,60,83,61],[84,81,85,102],[81,95,83,96],[81,48,83,51],[81,52,83,54],[81,81,83,87],[87,60,89,62],[81,63,100,65],[81,100,83,101],[86,81,96,102],[81,59,83,59],[81,62,83,62],[81,88,83,91],[81,66,100,78],[97,81,98,102],[99,81,100,102],[76,73,80,74],[76,75,80,76],[73,71,75,72],[73,73,75,74],[73,75,75,76],[76,69,80,70],[73,69,75,70],[76,71,80,72],[76,65,80,66],[76,67,80,68],[92,79,100,79],[73,81,75,92],[73,93,75,96],[73,97,75,98],[73,99,75,100],[73,101,75,102],[76,81,80,92],[76,93,80,96],[76,97,80,98],[76,99,80,100],[61,117,63,118],[73,65,75,66],[73,67,75,68],[70,71,72,72],[70,73,72,74],[64,71,66,72],[70,75,72,76],[70,77,72,78],[67,67,69,68],[64,69,66,70],[64,73,66,74],[64,75,66,76],[61,69,63,70],[73,77,75,78],[61,99,63,100],[61,101,63,102],[61,103,63,104],[64,117,66,118],[73,117,75,118],[70,65,72,66],[64,81,66,92],[61,77,63,78],[64,113,66,114],[61,73,63,74],[61,105,63,106],[61,107,63,108],[61,109,63,110],[61,111,63,112],[61,113,63,114],[64,97,66,98],[64,99,66,100],[64,101,66,102],[64,107,66,108],[64,109,66,110],[64,111,66,112],[64,105,66,106],[57,105,60,106],[64,93,66,96],[57,103,60,104],[61,115,63,116],[81,106,100,118],[73,107,75,108],[73,109,75,110],[76,115,80,116],[67,117,69,118],[70,111,72,112],[70,113,72,114],[70,115,72,116],[64,103,66,104],[76,117,80,118],[76,109,80,110],[76,111,80,112],[76,105,80,106],[76,107,80,108],[73,115,75,116],[76,113,80,114],[76,103,80,104],[73,103,75,104],[73,105,75,106],[73,111,75,112],[70,81,72,92],[70,93,72,96],[70,97,72,98],[70,99,72,100],[70,101,72,102],[70,103,72,104],[70,105,72,106],[70,107,72,108],[70,109,72,110],[67,81,69,92],[67,93,69,96],[67,97,69,98],[67,99,69,100],[67,101,69,102],[67,115,69,116],[64,37,66,38],[67,31,69,32],[67,33,69,34],[67,35,69,36],[67,37,69,38],[64,115,66,116],[67,111,69,112],[67,113,69,114],[67,105,69,106],[67,107,69,108],[67,71,69,72],[67,73,69,74],[67,75,69,76],[67,77,69,78],[64,41,66,52],[67,109,69,110],[64,53,66,56],[73,113,75,114],[70,117,72,118],[76,101,80,102],[64,77,66,78],[76,77,80,78],[67,103,69,104],[49,1,50,28],[56,17,56,18],[56,19,56,20],[49,29,50,38],[51,1,55,28],[51,30,52,31],[51,32,52,33],[51,34,52,35],[56,29,56,30],[56,31,56,32],[56,33,56,34],[56,1,56,16],[56,35,56,36],[56,37,56,38],[56,21,56,22],[56,23,56,24],[56,25,56,26],[56,27,56,28],[64,21,66,22],[64,23,66,24],[64,25,66,26],[64,27,66,28],[64,29,66,30],[67,1,69,12],[67,13,69,16],[67,17,69,18],[67,19,69,20],[67,21,69,22],[67,23,69,24],[67,25,69,26],[67,27,69,28],[64,1,66,12],[64,13,66,16],[64,17,66,18],[64,19,66,20],[57,1,60,12],[57,13,60,16],[57,17,60,18],[57,19,60,20],[57,21,60,22],[57,23,60,24],[57,25,60,26],[57,27,60,28],[61,29,63,30],[57,29,60,30],[61,1,63,12],[61,13,63,16],[61,17,63,18],[61,19,63,20],[61,21,63,22],[61,23,63,24],[61,25,63,26],[61,27,63,28],[81,26,100,38],[97,1,98,18],[99,2,100,13],[91,1,92,7],[93,1,95,7],[91,8,95,22],[81,19,83,19],[81,1,83,7],[81,8,83,11],[88,1,90,7],[84,1,85,7],[86,1,87,7],[84,8,90,22],[81,20,83,21],[81,17,83,18],[81,12,83,14],[81,15,83,16],[81,23,100,25],[81,22,83,22],[76,35,80,36],[76,37,80,38],[76,31,80,32],[70,35,72,36],[70,37,72,38],[64,31,66,32],[64,33,66,34],[64,35,66,36],[73,37,75,38],[73,35,75,36],[76,29,80,30],[70,29,72,30],[67,29,69,30],[76,23,80,24],[76,19,80,20],[76,21,80,22],[73,1,75,12],[76,33,80,34],[73,29,75,30],[73,31,75,32],[73,33,75,34],[70,31,72,32],[70,33,72,34],[15,41,18,64],[33,1,36,38],[19,6,19,38],[20,6,20,38],[76,25,80,26],[76,27,80,28],[73,23,75,24],[73,25,75,26],[73,27,75,28],[70,1,72,12],[70,13,72,16],[70,17,72,18],[70,19,72,20],[70,21,72,22],[70,23,72,24],[70,25,72,26],[70,27,72,28],[76,1,80,12],[76,13,80,16],[76,17,80,18],[73,13,75,16],[73,17,75,18],[73,19,75,20],[73,21,75,22]]}
["※この納付書は３枚１組です。点線部分を切り取り、ご使用ください。",null,null,null,null,null,null,null,null,null,null,null,null,null,null,null,null,null,null,null,null,null,null,null,null,null,null,null,null,null,null,null,null,null,null,null,null,null,null,null,null,null,null,null,null,null,null,null,null,null,null,null,null,null,null,null,null,null,null,null,null,null,null,null,null,{"$f":"B13","v":0},null,null,null,null,null,null,null,null,null,"※この様式は、東京都内の各区市町村でご使用いただけます。　　　　　　　　　　　\n※取扱金融機関等の詳細は、納付先の区市町村にお問い合わせください。",null,null,null,null,null,null,null,null,null,null,null,null,null,null,null,null,null,null,null,null,null,null,null,null,null,null,null,null,null,null,null,null,null,null,null,null,null,null,null,null,null,null,null,null,null,null,null,null,null,null,null,null,null,null,null,null,null,null,null,null,null,null,null,null,null,null,null,null,null,null,null,null,null,null,null,null,null,null,null,null,"に必要事項を入力し納付をお願いします。"]
[]
[]
[]
[null,"市区町村コード",null,null,null,null,null,null,null,null,null,null,null,null,null,null,null,null,null,null,null,null,null,null,null,null,null,null,null,null,null,null,null,null,null,null,null,null,null,null,null,"市区町村コード",null,null,null,null,null,null,null,null,null,null,null,null,null,null,null,null,null,null,null,null,null,null,null,null,null,null,null,null,null,null,null,null,null,null,null,null,null,null,null,"市区町村コード"]
[]
[null,{"$f":"AP7","v":{"$error":"#N/A"}},null,null,null,null,null,null,null,null,null,null,null,null,null,null,null,null,null,null,null,null,null,null,null,null,null,null,null,null,null,null,null,null,null,null,null,null,null,null,null,{"$f":"VLOOKUP(AP13,市区町村データ!$A$2:$I$63,2,FALSE)","v":{"$error":"#N/A"}},null,null,null,null,null,null,null,null,null,null,null,null,null,null,null,null,null,null,null,null,null,null,null,null,null,null,null,null,null,null,null,null,null,null,null,null,null,null,null,{"$f":"AP7","v":{"$error":"#N/A"}}]
[]
[null,null,null,null,null,null,null,null,null,null,null,null,"（区）市町村たばこ税領収済通知書",null,null,null,null,null,null,null,null,null,null,null,null,null,null,null,null,null,null,null,null,null,null,null,{"$f":"BY9","v":{"$error":"#N/A"}},null,null,null,null,null,null,null,null,null,null,null,null,null,null,null,"（区）市町村たばこ税納付書",null,null,null,null,null,null,null,null,null,null,null,null,null,null,null,null,null,null,null,null,null,null,null,{"$f":"VLOOKUP(AP13,市区町村データ!$A$2:$I$63,8,FALSE)","v":{"$error":"#N/A"}},null,null,null,null,null,null,null,null,null,null,null,null,null,null,null,"（区）市町村たばこ税領収証書",null,null,null,null,null,null,null,null,null,null,null,null,null,null,null,null,null,null,null,null,null,null,null,{"$f":"BY9","v":{"$error":"#N/A"}}]
[null,"東京都",null,null,null,null,null,null,null,null,null,null,null,null,null,null,null,null,null,null,null,null,null,null,null,null,null,null,null,null,null,null,null,null,null,null,null,null,null,null,null,"東京都",null,null,null,null,null,null,null,null,null,null,null,null,null,null,null,null,null,null,null,null,null,null,null,null,null,null,null,null,null,null,null,null,null,null,null,null,null,null,null,"東京都"]
[]
[]
[null,{"$f":"AP13","v":0},null,null,null,null,null,null,null,null,null,null,null,null,null,null,null,null,null,null,null,null,null,null,null,null,null,null,null,null,null,null,null,null,null,null,null,null,null,null,null,{"$f":"入力フォーム!D5","v":0},null,null,null,null,null,null,null,null,null,null,null,null,null,null,null,null,null,null,null,null,null,null,null,null,null,null,null,"（原符）",null,null,null,null,null,null,null,null,null,null,null,{"$f":"AP13","v":0}]
[null,"口　座　番　号",null,null,null,null,null,null,null,null,null,null,null,null,null,null,null,null,null,null,null,null,null,null,null,"加　　入　　者",null,null,null,null,null,null,null,null,null,null,null,null,null,null,null,"口　座　番　号",null,null,null,null,null,null,null,null,null,null,null,null,null,null,null,null,null,null,null,null,null,null,null,"加　　入　　者",null,null,null,null,null,null,null,null,null,null,null,null,null,null,null,"口　座　番　号",null,null,null,null,null,null,null,null,null,null,null,null,null,null,null,null,null,null,null,null,null,null,null,"加　　入　　者"]
[]
[null,{"$f":"AP16","v":{"$error":"#N/A"}},null,null,null,null,null,null,null,null,null,null,null,null,null,null,null,null,null,null,null,null,null,null,null,{"$f":"BN16","v":{"$error":"#N/A"}},null,null,null,null,null,null,null,null,null,null,null,null,null,null,null,{"$f":"VLOOKUP(AP13,市区町村データ!$A$2:$I$63,3,FALSE)","v":{"$error":"#N/A"}},null,null,null,null,null,null,null,null,null,null,null,null,null,null,null,null,null,null,null,null,null,null,null,{"$f":"VLOOKUP(AP13,市区町村データ!$A$2:$I$63,4,FALSE)","v":{"$error":"#N/A"}},null,null,null,null,null,null,null,null,null,null,null,null,null,null,null,{"$f":"AP16","v":{"$error":"#N/A"}},null,null,null,null,null,null,null,null,null,null,null,null,null,null,null,null,null,null,null,null,null,null,null,{"$f":"BN16","v":{"$error":"#N/A"}}]
[]
[]
[]
[null,"備考",null,null,null,null,{"$f":"AU20","v":{"$error":"#N/A"}},null,null,null,null,null,null,null,null,null,null,null,null,null,null,null,null,null,null,null,null,null,null,null,null,null,null,null,null,null,null,null,null,null,null,"備考",null,null,null,null,{"$f":"VLOOKUP(AP13,市区町村データ!$A$2:$L$63,9,FALSE)","v":{"$error":"#N/A"}},null,null,null,null,null,null,null,null,null,null,null,null,null,null,null,null,null,null,null,null,null,null,null,null,null,null,null,null,null,null,null,null,null,null,"備考",null,null,null,null,{"$f":"AU20","v":{"$error":"#N/A"}}]
[null,null,null,null,null,null,{"$f":"AU21","v":{"$error":"#N/A"}},null,null,null,null,null,null,null,null,null,null,null,null,null,null,null,null,null,null,null,null,null,null,null,null,null,null,null,null,null,null,null,null,null,null,null,null,null,null,null,{"$f":"VLOOKUP(AP13,市区町村データ!$A$2:$L$63,10,FALSE)","v":{"$error":"#N/A"}},null,null,null,null,null,null,null,null,null,null,null,null,null,null,null,null,null,null,null,null,null,null,null,null,null,null,null,null,null,null,null,null,null,null,null,null,null,null,null,{"$f":"AU21","v":{"$error":"#N/A"}}]
[null,null,null,null,null,null,{"$error":"#N/A"},null,null,null,null,null,null,null,null,null,null,null,null,null,null,null,null,null,null,null,null,null,null,null,null,null,null,null,null,null,null,null,null,null,null,null,null,null,null,null,{"$f":"VLOOKUP(AP13,市区町村データ!$A$2:$L$63,11,FALSE)","v":{"$error":"#N/A"}},null,null,null,null,null,null,null,null,null,null,null,null,null,null,null,null,null,null,null,null,null,null,null,null,null,null,null,null,null,null,null,null,null,null,null,null,null,null,null,{"$error":"#N/A"}]
[null,null,null,null,null,null,{"$error":"#N/A"},null,null,null,null,null,null,null,null,null,null,null,null,null,null,null,null,null,null,null,null,null,null,null,null,null,null,null,null,null,null,null,null,null,null,null,null,null,null,null,{"$f":"VLOOKUP(AP13,市区町村データ!$A$2:$L$63,12,FALSE)","v":{"$error":"#N/A"}},null,null,null,null,null,null,null,null,null,null,null,null,null,null,null,null,null,null,null,null,null,null,null,null,null,null,null,null,null,null,null,null,null,null,null,null,null,null,null,{"$error":"#N/A"}]
[null,"所在地及び氏名又は名称",null,null,null,null,null,null,null,null,null,null,null,null,null,null,null,null,null,null,null,null,null,null,null,null,null,null,null,null,null,null,null,null,null,null,null,null,null,null,null,"所在地及び氏名又は名称",null,null,null,null,null,null,null,null,null,null,null,null,null,null,null,null,null,null,null,null,null,null,null,null,null,null,null,null,null,null,null,null,null,null,null,null,null,null,null,"所在地及び氏名又は名称"]
[]
[null,{"$f":"AP26","v":0},null,null,null,null,null,null,null,null,null,null,null,null,null,null,null,null,null,null,null,null,null,null,null,null,null,null,null,null,null,null,null,null,null,null,null,null,null,null,null,{"$f":"入力フォーム!F11","v":0},null,null,null,null,null,null,null,null,null,null,null,null,null,null,null,null,null,null,null,null,null,null,null,null,null,null,null,null,null,null,null,null,null,null,null,null,null,null,null,{"$f":"AP26","v":0}]
[]
[]
[]
[]
[null,{"$f":"AP31","v":0},null,null,null,null,null,null,null,null,null,null,null,null,null,null,null,null,null,null,null,null,null,null,null,null,null,null,null,null,null,null,null,null,null,null,null,null,null,null,null,{"$f":"入力フォーム!F13","v":0},null,null,null,null,null,null,null,null,null,null,null,null,null,null,null,null,null,null,null,null,null,null,null,null,null,null,null,null,null,null,null,null,null,null,null,null,null,null,null,{"$f":"AP31","v":0}]
[]
[]
[null,{"$f":"AP34","v":"（店舗名）  "},null,null,null,null,null,null,null,null,null,null,null,null,null,null,null,null,null,null,null,null,null,null,null,null,null,null,null,null,null,null,null,null,null,null,null,null,null,null,null,{"$f":"\"（店舗名）  \"& 入力フォーム!F15","v":"（店舗名）  "},null,null,null,null,null,null,null,null,null,null,null,null,null,null,null,null,null,null,null,null,null,null,null,null,null,null,null,null,null,null,null,null,null,null,null,null,null,null,null,{"$f":"AP34","v":"（店舗名）  "}]
[]
[]
[]
[]
[null,{"$f":"AP39","v":"（店舗住所）"},null,null,null,null,null,null,null,null,null,null,null,null,null,null,null,null,null,null,null,null,null,null,null,null,null,null,null,null,null,null,null,null,null,null,null,null,null,null,null,{"$f":"\"（店舗住所）\"& 入力フォーム!F17","v":"（店舗住所）"},null,null,null,null,null,null,null,null,null,null,null,null,null,null,null,null,null,null,null,null,null,null,null,null,null,null,null,null,null,null,null,null,null,null,null,null,null,null,null,{"$f":"AP39","v":"（店舗住所）"}]
[]
{"$rows_left_out":67}
{"sheet":"市区町村データ","index":2,"n_rows":63,"n_cols":14,"rows_kept":63,"cut":false,"hidden":true,"merged":[[0,8,0,11]]}
["市町村名","市区町村\nコード","口座番号","加入者（案）",null,"指定金融機関\n（取りまとめ店）","取りまとめ店","右上\n数字","備考",null,null,null,"納付場所","ゆうちょ可否"]
["千代田区",131016,"00130-2-960001","千代田区会計管理者",null,"みずほ銀行東京中央支店","〒330-9794\nゆうちょ銀行東京貯金\n事務センター",1,null,null,null,null,"(納付場所）\n銀行、信用金庫など\n（ただし、ゆうちょ銀行の営業所及び郵便局については東京都内並びに関東各県及び山梨県に所在する店舗に限る）",1]
["中央区",131024,"00160-6-960004","中央区会計管理者",null,"みずほ銀行公務第一部","〒330-9794\nゆうちょ銀行東京貯金\n事務センター",4,null,null,null,null,"(納付場所）\n銀行、信用金庫など\n（ただし、ゆうちょ銀行の営業所及び郵便局については東京都内並びに関東各県及び山梨県に所在する店舗に限る）",1]
["港区",131032,"00170-8-960005","港区会計管理者",null,"みずほ銀行公務事務センター","〒330-9794\nゆうちょ銀行東京貯金\n事務センター",5,null,null,null,null,"(納付場所）\n銀行、信用金庫など\n（ただし、ゆうちょ銀行の営業所及び郵便局については東京都内並びに関東各県及び山梨県に所在する店舗に限る）",1]
["新宿区",131041,"00110-4-960009","新宿区会計管理者",null,null,"〒330-9794\nゆうちょ銀行東京貯金\n事務センター",9,null,null,null,null,"(納付場所）\n銀行、信用金庫など\n（ただし、ゆうちょ銀行の営業所及び郵便局については東京都内並びに関東各県及び山梨県に所在する店舗に限る）",1]
["文京区",131059,"00140-7-960010","文京区会計管理者",null,null,"〒330-9794\nゆうちょ銀行東京貯金\n事務センター",10,null,null,null,null,"(納付場所）\n銀行、信用金庫など\n（ただし、ゆうちょ銀行の営業所及び郵便局については東京都内並びに関東各県及び山梨県に所在する店舗に限る）",1]
["台東区",131067,"00160-0-960012","東京都台東区会計管理者",null,"みずほ銀行公務第一部","〒330-9794\nゆうちょ銀行東京貯金\n事務センター",12,null,null,null,null,"(納付場所）\n銀行、信用金庫など\n（ただし、ゆうちょ銀行の営業所及び郵便局については東京都内並びに関東各県及び山梨県に所在する店舗に限る）",1]
["墨田区",131075,"00180-3-960014","墨田区会計管理者",null,null,"〒330-9794\nゆうちょ銀行東京貯金\n事務センター",14,"会計01　区一般会計｜款01　特別区税","項03　特別区たばこ税","目01　特別区たばこ税",null,"(納付場所）\n銀行、信用金庫など\n（ただし、ゆうちょ銀行の営業所及び郵便局については東京都内並びに関東各県及び山梨県に所在する店舗に限る）",1]
["江東区",131083,"00190-5-960015","江東区会計管理者",null,"みずほ銀行公務第一部","〒330-9794\nゆうちょ銀行東京貯金\n事務センター",15,null,null,null,null,"(納付場所）\n銀行、信用金庫など\n（ただし、ゆうちょ銀行の営業所及び郵便局については東京都内並びに関東各県及び山梨県に所在する店舗に限る）",1]
["品川区",131091,"00120-9-960018","品川区会計管理者",null,"みずほ銀行公務第一部","〒330-9794\nゆうちょ銀行東京貯金\n事務センター",18,null,null,null,null,"(納付場所）\n銀行、信用金庫など\n（ただし、ゆうちょ銀行の営業所及び郵便局については東京都内並びに関東各県及び山梨県に所在する店舗に限る）",1]
["目黒区",131105,"00130-1-960019","目黒区会計管理者",null,"みずほ銀行目黒支店","〒330-9794\nゆうちょ銀行東京貯金\n事務センター",19,null,null,null,null,"(納付場所）\n銀行、信用金庫など\n（ただし、ゆうちょ銀行の営業所及び郵便局については東京都内並びに関東各県及び山梨県に所在する店舗に限る）",1]
["大田区",131113,"00170-6-960021","大田区会計管理者",null,null,"〒330-9794\nゆうちょ銀行東京貯金\n事務センター",21,null,null,null,null,"(納付場所）\n銀行、信用金庫など\n（ただし、ゆうちょ銀行の営業所及び郵便局については東京都内並びに関東各県及び山梨県に所在する店舗に限る）",1]
["世田谷区",131121,"00190-9-960023","世田谷区",null,null,"〒330-9794\nゆうちょ銀行東京貯金\n事務センター",23,"令和２年度｜会計 一般会計｜款 特別区税\n","｜項 特別区たばこ税｜目 特別区たばこ税","｜財務部納税課",null,"(納付場所）\n銀行、信用金庫など\n（ただし、ゆうちょ銀行の営業所及び郵便局については東京都内並びに関東各県及び山梨県に所在する店舗に限る）",1]
["渋谷区",131130,"00100-0-960024","渋谷区会計管理者",null,"みずほ銀行渋谷支店","〒330-9794\nゆうちょ銀行東京貯金\n事務センター",24,null,null,null,null,"(納付場所）\n銀行、信用金庫など\n（ただし、ゆうちょ銀行の営業所及び郵便局については東京都内並びに関東各県及び山梨県に所在する店舗に限る）",1]
["中野区",131148,"00120-3-960026","中野区会計管理者",null,"みずほ銀行中野支店","〒330-9794\nゆうちょ銀行東京貯金\n事務センター",26,null,null,null,null,"(納付場所）\n銀行、信用金庫など\n（ただし、ゆうちょ銀行の営業所及び郵便局については東京都内並びに関東各県及び山梨県に所在する店舗に限る）",1]
["杉並区",131156,"00130-5-960027","杉並区会計管理者",null,"みずほ銀行荻窪支店","〒330-9794\nゆうちょ銀行東京貯金\n事務センター",27,"種別｜区分｜年度｜会計｜款｜項｜目｜節｜"," 905｜ 　1｜  02｜  01｜01｜03｜01｜01｜","細節｜性質｜主管課｜","　01｜010 ｜101300｜課税課税務管理係","(納付場所）                                                              銀行・信用金庫など（杉並区指定金融機関・特別区公金収納取扱店）ただし、ゆうちょ銀行及び郵便局は、東京都・山梨県及び関東各県所在の店舗に限る。\n杉並区役所　",1]
["豊島区",131164,"00140-6-960028","豊島区会計管理者",null,null,"〒330-9794\nゆうちょ銀行東京貯金\n事務センター",28,"款01｜項03｜目01｜節01｜細節01｜",null,"担当課　202000税務課",null,"(納付場所）\n銀行、信用金庫など\n（ただし、ゆうちょ銀行の営業所及び郵便局については東京都内並びに関東各県及び山梨県に所在する店舗に限る）",1]
["北区",131172,"00190-3-960031","東京都北区会計管理者",null,"みずほ銀行王子支店","〒330-9794\nゆうちょ銀行東京貯金\n事務センター",31,null,null,null,null,"(納付場所）\n銀行、信用金庫など\n（ただし、ゆうちょ銀行の営業所及び郵便局については東京都内並びに関東各県及び山梨県に所在する店舗に限る）",1]
["荒川区",131181,"00180-1-960030","荒川区会計管理者",null,null,"〒330-9794\nゆうちょ銀行東京貯金\n事務センター",30,null,null,null,null,"(納付場所）\n銀行、信用金庫など\n（ただし、ゆうちょ銀行の営業所及び郵便局については東京都内並びに関東各県及び山梨県に所在する店舗に限る）",1]
["板橋区",131199,"00100-4-960032","東京都板橋区会計管理者",null,"みずほ銀行公務第一部","〒330-9794\nゆうちょ銀行東京貯金\n事務センター",32,null,null,null,null,"(納付場所）\n銀行、信用金庫など\n（ただし、ゆうちょ銀行の営業所及び郵便局については東京都内並びに関東各県及び山梨県に所在する店舗に限る）",1]
["練馬区",131202,"00170-5-960039","練馬区会計管理者",null,"みずほ銀行練馬富士見台支店","〒330-9794\nゆうちょ銀行東京貯金\n事務センター",39,null,null,null,null,"(納付場所）\n銀行、信用金庫など\n（ただし、ゆうちょ銀行の営業所及び郵便局については東京都内並びに関東各県及び山梨県に所在する店舗に限る）",1]
["足立区",131211,"00110-6-960033","足立区会計管理者",null,"みずほ銀行千住支店","〒330-9794\nゆうちょ銀行東京貯金\n事務センター",33,null,null,null,null,"(納付場所）\n銀行、信用金庫など\n（ただし、ゆうちょ銀行の営業所及び郵便局については東京都内並びに関東各県及び山梨県に所在する店舗に限る）",1]
["葛飾区",131229,"00140-0-960036","葛飾区会計管理者",null,"みずほ銀行葛飾支店","〒330-9794\nゆうちょ銀行東京貯金\n事務センター",36,null,null,null,null,"(納付場所）\n銀行、信用金庫など\n（ただし、ゆうちょ銀行の営業所及び郵便局については東京都内並びに関東各県及び山梨県に所在する店舗に限る）",1]
["江戸川区",131237,"00150-2-960037","江戸川区会計管理者",null,"みずほ銀行小松川支店","〒330-9794\nゆうちょ銀行東京貯金\n事務センター",37,null,null,null,null,"(納付場所）\n銀行、信用金庫など\n（ただし、ゆうちょ銀行の営業所及び郵便局については東京都内並びに関東各県及び山梨県に所在する店舗に限る）",1]
["八王子市",132012,"00180-7-963304","八王子市会計管理者",null,null,"〒330-9794\nゆうちょ銀行東京貯金\n事務センター",304,null,null,null,null,"(納付場所）\n銀行、信用金庫など\n（ただし、ゆうちょ銀行の営業所及び郵便局については東京都内並びに関東各県及び山梨県に所在する店舗に限る）",1]
["立川市",132021,"00110-5-960114","立川市会計管理者",null,"みずほ銀行立川支店","〒330-9794\nゆうちょ銀行東京貯金\n事務センター",114,null,null,null,null,"(納付場所）\n銀行、信用金庫など\n（ただし、ゆうちょ銀行の営業所及び郵便局については東京都内並びに関東各県及び山梨県に所在する店舗に限る）",1]
["武蔵野市",132039,"00150-4-961572","武蔵野市会計管理者",null,"三菱東京UFJ銀行","〒330-9794\nゆうちょ銀行東京貯金\n事務センター",572,null,null,null,null,"(納付場所）\n銀行、信用金庫など\n（ただし、ゆうちょ銀行の営業所及び郵便局については東京都内並びに関東各県及び山梨県に所在する店舗に限る）",1]
["三鷹市",132047,"00170-4-960371","三鷹市会計管理者",null,"株式会社みずほ銀行三鷹支店","〒330-9794\nゆうちょ銀行東京貯金\n事務センター",371,null,null,null,null,"(納付場所）\n銀行、信用金庫など\n（ただし、ゆうちょ銀行の営業所及び郵便局については東京都内並びに関東各県及び山梨県に所在する店舗に限る）",1]
["青梅市",132055,null,null,null,null,null,null,null,null,null,null,"(納付場所）\n銀行、信用金庫など\n（ただし、ゆうちょ銀行・郵便局ではご使用いただけません）",0]
["府中市",132063,null,null,null,null,null,null,null,null,null,null,"(納付場所）\n銀行、信用金庫など\n（ただし、ゆうちょ銀行・郵便局ではご使用いただけません）",0]
["昭島市",132071,null,null,null,"多摩信用金庫昭島支店",null,null,"（口座番号）4053531",null,null,null,"(納付場所）\n銀行、信用金庫など\n（ただし、ゆうちょ銀行・郵便局ではご使用いただけません）",0]
["調布市",132080,null,null,null,"みずほ銀行調布支店",null,null,null,null,null,null,"(納付場所）\n銀行、信用金庫など\n（ただし、ゆうちょ銀行・郵便局ではご使用いただけません）",0]
["町田市",132098,"00170-0-960567","東京都町田市会計管理者",null,null,"〒330-9794\nゆうちょ銀行東京貯金\n事務センター",567,null,null,null,null,"(納付場所）\n銀行、信用金庫など\n（ただし、ゆうちょ銀行の営業所及び郵便局については東京都内並びに関東各県及び山梨県に所在する店舗に限る）",1]
["小金井市",132101,"00100-8-961569","小金井市",null,"みずほ銀行小金井支店","〒330-9794\nゆうちょ銀行東京貯金\n事務センター",1569,null,null,null,null,"(納付場所）\n銀行、信用金庫など\n（ただし、ゆうちょ銀行の営業所及び郵便局については東京都内並びに関東各県及び山梨県に所在する店舗に限る）",1]
["小平市",132110,"00120-9-962430","小平市会計管理者",null,"りそな銀行小平支店","〒330-9794\nゆうちょ銀行東京貯金\n事務センター",430,null,null,null,null,"(納付場所）\n銀行、信用金庫など\n（ただし、ゆうちょ銀行の営業所及び郵便局については東京都内並びに関東各県及び山梨県に所在する店舗に限る）",1]
["日野市",132128,null,null,null,"三菱ＵＦＪ銀行（日野市役所支店）",null,null,null,null,null,null,"(納付場所）\n銀行、信用金庫など\n（ただし、ゆうちょ銀行・郵便局ではご使用いただけません）",0]
["東村山市",132136,null,null,null,null,null,null,null,null,null,null,"(納付場所）\n銀行、信用金庫など\n（ただし、ゆうちょ銀行・郵便局ではご使用いただけません）",0]
["国分寺市",132144,"00170-6-960151","東京都国分寺市会計管理者",null,"多摩信用金庫　国分寺支店","〒330-9794\nゆうちょ銀行東京貯金\n事務センター",151,null,null,null,null,"(納付場所）\n銀行、信用金庫など\n（ただし、ゆうちょ銀行の営業所及び郵便局については東京都内並びに関東各県及び山梨県に所在する店舗に限る）",1]
["国立市",132152,"00130-5-962977","東京都国立市",null,null,"〒330-9794\nゆうちょ銀行東京貯金\n事務センター",977,null,null,null,null,"(納付場所）\n銀行、信用金庫など\n（ただし、ゆうちょ銀行の営業所及び郵便局については東京都内並びに関東各県及び山梨県に所在する店舗に限る）",1]
["福生市",132187,null,null,null,null,null,null,null,null,null,null,"(納付場所）\n銀行、信用金庫など\n（ただし、ゆうちょ銀行・郵便局ではご使用いただけません）",0]
{"$rows_left_out":23}